{"text_format":"1","workbook":"xlsx","n_sheets":10,"sheets":["Instructions","Affordable Units","Rental Budget","Median Costs & Relocation","Pro Forma","Amortization Table","Program","Dev Budget","Program Summary","Verifications"],"not_rendered":{"charts":0,"images":0,"macros":1,"external_links":2,"defined_names":1,"comments":1,"pivot_tables":0},"unopened":[],"bounds":{"document_bytes":16777216,"sheet_cells":100000,"rows_first":2000,"rows_last":500,"rows_between":2000,"halvings":0,"cell_chars":16384,"cell_head_chars":4096},"cells_cut":0,"cells_raw":0,"read":"whole","date_system":"1900"}

{"sheet":"Instructions","index":0,"n_rows":18,"n_cols":4,"rows_kept":18,"cut":false,"hidden":false,"merged":[[17,2,17,6],[16,2,16,6],[1,0,1,8],[4,0,4,8],[13,2,13,6],[14,2,14,6],[15,2,15,6],[2,0,2,8],[11,0,11,7]]}
[]
["Exhibit D - EEHDP Excel Template"]
["Introduction to the Workbook"]
["INSTRUCTIONS"]
["This document serves as the Excel portion of the East End Housing Development Program application for both rental and for-sale projects. Fill out the information in the \"Basic Project Information\" section below, then click \"Run\"."]
[]
["Throughout the workbook, please adhere to the following cell color prompts:"]
[]
[null,null,null,"Blue - empty cell to be filled in"]
[null,null,null,"Yellow - formula cell that will autopopulate; do not change"]
{"$rows_left_out":9}
{"sheet":"Affordable Units","index":1,"n_rows":22,"n_cols":8,"rows_kept":22,"cut":false,"hidden":true,"merged":[[18,0,18,7],[19,0,19,7],[21,0,21,7],[11,0,11,6],[12,0,12,6],[13,0,13,6],[16,0,16,7],[17,0,17,6],[20,0,20,7],[10,0,10,6],[4,0,4,7],[7,0,7,6],[8,0,8,7],[9,0,9,6]]}
[]
["PROJECT NAME",{"$f":"[1]Instructions!$C$15","v":"Project A"}]
["DEVELOPER/SPONSOR",{"$f":"[1]Instructions!$C$17","v":"Apex Developers"}]
[]
["Minimum Affordable Unit Verification - Rental"]
[]
["Verification (MANDATORY)",null,null,null,null,null,null,{"$f":"IF(H13=\"No\",\"Original Proposal\",\"\")","v":""}]
["Total Number of Units (Affordable and Market-Rate)",null,null,null,null,null,null,{"$f":"Instructions!C18","v":6}]
[]
["Proposed Number of Units Affordable to 50% AMI",null,null,null,null,null,null,5]
{"$rows_left_out":13}
{"sheet":"Rental Budget","index":2,"n_rows":146,"n_cols":9,"rows_kept":146,"cut":false,"hidden":true,"merged":[[141,1,141,3],[142,1,142,3],[115,1,115,3],[126,1,126,3],[127,1,127,3],[128,1,128,3],[129,1,129,3],[140,1,140,3],[114,1,114,3],[74,1,74,3],[85,1,85,3],[86,1,86,3],[87,1,87,3],[88,1,88,3],[100,1,100,3],[101,1,101,3],[102,1,102,3],[103,1,103,3],[112,1,112,3],[113,1,113,3],[73,1,73,3],[1,2,1,8],[2,2,2,8],[4,0,4,8],[5,0,5,8],[50,1,50,3],[51,1,51,3],[52,1,52,3],[53,1,53,3],[54,2,54,3],[69,1,69,3],[72,1,72,3]]}
[]
["PROJECT NAME",null,{"$f":"[1]Instructions!$C$15","v":"Project A"},{"$f":"[1]Instructions!$C$15","v":"Project A"},{"$f":"[1]Instructions!$C$15","v":"Project A"},{"$f":"[1]Instructions!$C$15","v":"Project A"},{"$f":"[1]Instructions!$C$15","v":"Project A"},{"$f":"[1]Instructions!$C$15","v":"Project A"},{"$f":"[1]Instructions!$C$15","v":"Project A"}]
["DEVELOPER/SPONSOR",null,{"$f":"[1]Instructions!$C$17","v":"Apex Developers"},{"$f":"[1]Instructions!$C$17","v":"Apex Developers"},{"$f":"[1]Instructions!$C$17","v":"Apex Developers"},{"$f":"[1]Instructions!$C$17","v":"Apex Developers"},{"$f":"[1]Instructions!$C$17","v":"Apex Developers"},{"$f":"[1]Instructions!$C$17","v":"Apex Developers"},{"$f":"[1]Instructions!$C$17","v":"Apex Developers"}]
[]
["Rental Development Budget with"]
["Permanent Sources"]
[]
[]
["Total Units",null,{"$f":"Instructions!C18","v":6}]
["Total Square Feet",null,10000]
{"$rows_left_out":137}
{"sheet":"Median Costs & Relocation","index":3,"n_rows":36,"n_cols":9,"rows_kept":36,"cut":false,"hidden":true,"merged":[[1,2,1,8],[2,2,2,8],[4,0,4,7],[17,0,17,7]]}
[]
["PROJECT NAME",null,{"$f":"[1]Instructions!$C$15","v":"Project A"},{"$f":"[1]Instructions!$C$15","v":"Project A"},{"$f":"[1]Instructions!$C$15","v":"Project A"},{"$f":"[1]Instructions!$C$15","v":"Project A"},{"$f":"[1]Instructions!$C$15","v":"Project A"},{"$f":"[1]Instructions!$C$15","v":"Project A"},{"$f":"[1]Instructions!$C$15","v":"Project A"}]
["DEVELOPER/SPONSOR",null,{"$f":"[1]Instructions!$C$17","v":"Apex Developers"},{"$f":"[1]Instructions!$C$17","v":"Apex Developers"},{"$f":"[1]Instructions!$C$17","v":"Apex Developers"},{"$f":"[1]Instructions!$C$17","v":"Apex Developers"},{"$f":"[1]Instructions!$C$17","v":"Apex Developers"},{"$f":"[1]Instructions!$C$17","v":"Apex Developers"},{"$f":"[1]Instructions!$C$17","v":"Apex Developers"}]
[]
["Comparison with PHFA Median Costs"]
[]
[]
["Calculated Project Cost/SF",null,null,null,null,{"$f":"'Rental Budget'!G146/'Rental Budget'!C10","v":0.3}]
[]
[]
{"$rows_left_out":27}
{"sheet":"Pro Forma","index":4,"n_rows":131,"n_cols":29,"rows_kept":131,"cut":false,"hidden":true,"merged":[[2,2,2,14],[3,2,3,14],[5,0,5,14],[89,15,89,18]]}
["0 BR","1 BR","2 BR","3 BR","4 BR","Other"]
[]
["PROJECT NAME",null,{"$f":"[1]Instructions!$C$15","v":"Project A"},{"$f":"[1]Instructions!$C$15","v":"Project A"},{"$f":"[1]Instructions!$C$15","v":"Project A"},{"$f":"[1]Instructions!$C$15","v":"Project A"},{"$f":"[1]Instructions!$C$15","v":"Project A"},{"$f":"[1]Instructions!$C$15","v":"Project A"},{"$f":"[1]Instructions!$C$15","v":"Project A"},{"$f":"[1]Instructions!$C$15","v":"Project A"},{"$f":"[1]Instructions!$C$15","v":"Project A"},{"$f":"[1]Instructions!$C$15","v":"Project A"},{"$f":"[1]Instructions!$C$15","v":"Project A"},{"$f":"[1]Instructions!$C$15","v":"Project A"},{"$f":"[1]Instructions!$C$15","v":"Project A"}]
["DEVELOPER/SPONSOR",null,{"$f":"[1]Instructions!$C$17","v":"Apex Developers"},{"$f":"[1]Instructions!$C$17","v":"Apex Developers"},{"$f":"[1]Instructions!$C$17","v":"Apex Developers"},{"$f":"[1]Instructions!$C$17","v":"Apex Developers"},{"$f":"[1]Instructions!$C$17","v":"Apex Developers"},{"$f":"[1]Instructions!$C$17","v":"Apex Developers"},{"$f":"[1]Instructions!$C$17","v":"Apex Developers"},{"$f":"[1]Instructions!$C$17","v":"Apex Developers"},{"$f":"[1]Instructions!$C$17","v":"Apex Developers"},{"$f":"[1]Instructions!$C$17","v":"Apex Developers"},{"$f":"[1]Instructions!$C$17","v":"Apex Developers"},{"$f":"[1]Instructions!$C$17","v":"Apex Developers"},{"$f":"[1]Instructions!$C$17","v":"Apex Developers"}]
[]
["Rental Project Operating Pro Forma"]
[]
[]
["Rental Income"]
["Unit Type","Number of Units","Per Unit Sq Ft","Total Sq Ft","Restriction on % AMI","Per Unit Monthly Gross Rent","Utility Deductions","Per Unit Monthly Net Rent","Per Unit Net Rent Per Sq Ft","Total Monthly Net Income","Total Annual Net Rent"]
{"$rows_left_out":122}
{"sheet":"Amortization Table","index":5,"n_rows":800,"n_cols":12,"rows_kept":800,"cut":false,"hidden":true,"merged":[[16,0,16,3]]}
["Simple Interest Loan Calculator"]
["HELP",null,null,null,null,null,null,"© 2008 Vertex42 LLC"]
[null,null,null,null,null,null,null,null,null,"Payment Frequency Options"]
["Loan Information",null,null,null,"[42]","Summary",null,null,null,"Frequency","Payments/yr","Months"]
[null,null,"Loan Amount",0,null,null,"Daily Interest Rate",{"$f":"D6/D11","v":8.219178082191781E-5},null,"Annual",1,12]
[null,null,"Annual Interest Rate",0.03,null,null,"Number of Payments",{"$f":"MAX(A18:A799)","v":1},null,"Semi-Annual",2,6]
[null,null,"Term of Loan in Years",20,null,null,"Total Payments",{"$f":"SUM(C20:C799)","v":0},null,"Quarterly",4,3]
[null,null,"First Day Interest Accrues","2021-01-01",null,null,"Total Interest",{"$f":"SUM(D20:D800)","v":0},null,"Bi-Monthly",6,2]
[null,null,"First Payment Date","2021-02-01",null,null,"Balloon Payment",{"$f":"IF(D12=\"\",0,OFFSET(C18,D12+1,0,1,1))","v":0},null,"Monthly",12,1]
[null,null,"Payment Frequency","Monthly",null,null,null,{"$f":"IF(AND(NOT(H799=\"\"),H799>0.004),\"ERROR: Limit is \"&OFFSET(A800,-1,0,1,1)&\" payments\",\".\")","v":"."},null,"Semi-Monthly",24,0.5]
{"$rows_left_out":791}
{"sheet":"Program","index":6,"n_rows":19,"n_cols":14,"rows_kept":19,"cut":false,"hidden":false,"merged":[[4,0,4,13]]}
[]
["PROJECT NAME",{"$f":"[2]Instructions!$C$15","v":"Project A"}]
["DEVELOPER/SPONSOR",{"$f":"[2]Instructions!$C$16","v":"Apex Developers"}]
[]
["For-Sale Program"]
[]
[null,"Property Address","Project Type","Gross Square Footage","Anticipated Sale Price","Target affordability:",null,null,null,"Letter","Project Type","Number of Projects","Average GSF","Sale Price"]
[1,"1 Main St","2B 2ba, East Liberty",2200,150000,null,null,null,null,"A",{"$f":"IFERROR(INDEX($C$8:$C$17,MATCH(0,COUNTIF($K$7:K7,$C$8:$C$17),0)),0)","v":"2B 2ba, East Liberty"},{"$f":"IF(ISTEXT(K8)=TRUE,COUNTIFS($C$8:$C$17,K8),\"\")","v":2},{"$f":"IFERROR(AVERAGEIFS($D$8:$D$17,$C$8:$C$17,K8),\"\")","v":2200},{"$f":"IFERROR(AVERAGEIFS($E$8:$E$17,$C$8:$C$17,K8),\"\")","v":150000}]
[{"$f":"A8+1","v":2},"2 Main St","2B 2ba, East Liberty",2200,150000,null,null,null,null,"B",{"$f":"IFERROR(INDEX($C$8:$C$17,MATCH(0,COUNTIF($K$7:K8,$C$8:$C$17),0)),0)","v":"3B 2ba, East Liberty"},{"$f":"IF(ISTEXT(K9)=TRUE,COUNTIFS($C$8:$C$17,K9),\"\")","v":1},{"$f":"IFERROR(AVERAGEIFS($D$8:$D$17,$C$8:$C$17,K9),\"\")","v":3000},{"$f":"IFERROR(AVERAGEIFS($E$8:$E$17,$C$8:$C$17,K9),\"\")","v":160000}]
[{"$f":"A9+1","v":3},"3 Main St","3B 2ba, East Liberty",3000,160000,null,null,null,null,"C",{"$f":"IFERROR(INDEX($C$8:$C$17,MATCH(0,COUNTIF($K$7:K9,$C$8:$C$17),0)),0)","v":"2B 2ba, Larimer"},2,2000,200000]
{"$rows_left_out":10}
{"sheet":"Dev Budget","index":7,"n_rows":108,"n_cols":107,"rows_kept":108,"cut":false,"hidden":false,"merged":[[104,99,104,100],[103,89,103,90],[103,99,103,100],[104,9,104,10],[104,19,104,20],[104,29,104,30],[104,39,104,40],[104,49,104,50],[104,59,104,60],[104,69,104,70],[104,79,104,80],[103,9,103,10],[103,19,103,20],[103,29,103,30],[103,39,103,40],[103,49,103,50],[103,59,103,60],[103,69,103,70],[103,79,103,80],[104,89,104,90],[93,99,93,100],[94,9,94,10],[94,19,94,20],[94,29,94,30],[94,39,94,40],[94,49,94,50],[94,59,94,60],[94,69,94,70],[94,79,94,80],[94,89,94,90],[94,99,94,100],[93,9,93,10],[93,19,93,20],[93,29,93,30],[93,39,93,40],[93,49,93,50],[93,59,93,60],[93,69,93,70],[93,79,93,80],[93,89,93,90],[80,99,80,100],[81,9,81,10],[81,19,81,20],[81,29,81,30],[81,39,81,40],[81,49,81,50],[81,59,81,60],[81,69,81,70],[81,79,81,80],[81,89,81,90],[81,99,81,100],[80,9,80,10],[80,19,80,20],[80,29,80,30],[80,39,80,40],[80,49,80,50],[80,59,80,60],[80,69,80,70],[80,79,80,80],[80,89,80,90],[74,99,74,100],[75,9,75,10],[75,19,75,20],[75,29,75,30],[75,39,75,40],[75,49,75,50],[75,59,75,60],[75,69,75,70],[75,79,75,80],[75,89,75,90],[75,99,75,100],[74,9,74,10],[74,19,74,20],[74,29,74,30],[74,39,74,40],[74,49,74,50],[74,59,74,60],[74,69,74,70],[74,79,74,80],[74,89,74,90],[56,99,56,100],[57,9,57,10],[57,19,57,20],[57,29,57,30],[57,39,57,40],[57,49,57,50],[57,59,57,60],[57,69,57,70],[57,79,57,80],[57,89,57,90],[57,99,57,100],[56,9,56,10],[56,19,56,20],[56,29,56,30],[56,39,56,40],[56,49,56,50],[56,59,56,60],[56,69,56,70],[56,79,56,80],[56,89,56,90],[41,99,41,100],[42,9,42,10],[42,19,42,20],[42,29,42,30],[42,39,42,40],[42,49,42,50],[42,59,42,60],[42,69,42,70],[42,79,42,80],[42,89,42,90],[42,99,42,100],[41,9,41,10],[41,19,41,20],[41,29,41,30],[41,39,41,40],[41,49,41,50],[41,59,41,60],[41,69,41,70],[41,79,41,80],[41,89,41,90],[22,99,22,100],[23,9,23,10],[23,19,23,20],[23,29,23,30],[23,39,23,40],[23,49,23,50],[23,59,23,60],[23,69,23,70],[23,79,23,80],[23,89,23,90],[23,99,23,100],[22,9,22,10],[22,19,22,20],[22,29,22,30],[22,39,22,40],[22,49,22,50],[22,59,22,60],[22,69,22,70],[22,79,22,80],[22,89,22,90],[1,2,1,6],[2,2,2,6],[4,0,4,6],[5,0,5,6],[15,9,15,10],[15,19,15,20],[15,89,15,90],[15,99,15,100],[16,9,16,10],[16,19,16,20],[16,29,16,30],[16,39,16,40],[16,49,16,50],[16,59,16,60],[16,69,16,70],[16,79,16,80],[15,29,15,30],[15,39,15,40],[15,49,15,50],[15,59,15,60],[15,69,15,70],[15,79,15,80],[16,89,16,90],[16,99,16,100]]}
[]
["PROJECT NAME",null,{"$f":"[2]Instructions!$C$15","v":"Project A"},{"$f":"[2]Instructions!$C$15","v":"Project A"},{"$f":"[2]Instructions!$C$15","v":"Project A"},{"$f":"[2]Instructions!$C$15","v":"Project A"},{"$f":"[2]Instructions!$C$15","v":"Project A"}]
["DEVELOPER/SPONSOR",null,{"$f":"[2]Instructions!$C$16","v":"Apex Developers"},{"$f":"[2]Instructions!$C$16","v":"Apex Developers"},{"$f":"[2]Instructions!$C$16","v":"Apex Developers"},{"$f":"[2]Instructions!$C$16","v":"Apex Developers"},{"$f":"[2]Instructions!$C$16","v":"Apex Developers"}]
[]
["For-Sale Development Budget with"]
["Permanent Sources"]
[null,null,null,null,null,null,null,null,{"$f":"ROW([2]Program!$K$8)","v":8},null,null,null,null,null,null,null,null,null,{"$f":"I7+1","v":9},null,null,null,null,null,null,null,null,null,{"$f":"S7+1","v":10},null,null,null,null,null,null,null,null,null,{"$f":"AC7+1","v":11},null,null,null,null,null,null,null,null,null,{"$f":"AM7+1","v":12},null,null,null,null,null,null,null,null,null,{"$f":"AW7+1","v":13},null,null,null,null,null,null,null,null,null,{"$f":"BG7+1","v":14},null,null,null,null,null,null,null,null,null,{"$f":"BQ7+1","v":15},null,null,null,null,null,null,null,null,null,{"$f":"CA7+1","v":16},null,null,null,null,null,null,null,null,null,{"$f":"CK7+1","v":17}]
["SUMMARY",null,null,null,null,null,null,null,{"$f":"_xlfn.CONCAT(\"Type \",INDIRECT(\"program!j\"&I7),\": \",INDIRECT(\"Program!K\"&I7))","v":"Type A: 2B 2ba, East Liberty"},null,null,null,null,null,null,null,null,null,{"$f":"_xlfn.CONCAT(\"Type \",INDIRECT(\"program!j\"&S7),\": \",INDIRECT(\"Program!K\"&S7))","v":"Type B: 3B 2ba, East Liberty"},null,null,null,null,null,null,null,null,null,{"$f":"_xlfn.CONCAT(\"Type \",INDIRECT(\"program!j\"&AC7),\": \",INDIRECT(\"Program!K\"&AC7))","v":"Type C: 2B 2ba, Larimer"},null,null,null,null,null,null,null,null,null,{"$f":"_xlfn.CONCAT(\"Type \",INDIRECT(\"program!j\"&AM7),\": \",INDIRECT(\"Program!K\"&AM7))","v":"Type D: 0"},null,null,null,null,null,null,null,null,null,{"$f":"_xlfn.CONCAT(\"Type \",INDIRECT(\"program!j\"&AW7),\": \",INDIRECT(\"Program!K\"&AW7))","v":"Type E: 0"},null,null,null,null,null,null,null,null,null,{"$f":"_xlfn.CONCAT(\"Type \",INDIRECT(\"program!j\"&BG7),\": \",INDIRECT(\"Program!K\"&BG7))","v":"Type F: 0"},null,null,null,null,null,null,null,null,null,{"$f":"_xlfn.CONCAT(\"Type \",INDIRECT(\"program!j\"&BQ7),\": \",INDIRECT(\"Program!K\"&BQ7))","v":"Type G: 0"},null,null,null,null,null,null,null,null,null,{"$f":"_xlfn.CONCAT(\"Type \",INDIRECT(\"program!j\"&CA7),\": \",INDIRECT(\"Program!K\"&CA7))","v":"Type H: 0"},null,null,null,null,null,null,null,null,null,{"$f":"_xlfn.CONCAT(\"Type \",INDIRECT(\"program!j\"&CK7),\": \",INDIRECT(\"Program!K\"&CK7))","v":"Type I: 0"},null,null,null,null,null,null,null,null,null,{"$f":"_xlfn.CONCAT(\"Type \",INDIRECT(\"program!j\"&CU7),\": \",INDIRECT(\"Program!K\"&CU7))","v":"Type J: 0"}]
["Total Units",null,{"$f":"Instructions!C18","v":6},null,null,null,null,null,{"$f":"$A9","v":"Total Units"},null,{"$f":"INDIRECT(\"Program!L\"&I7)","v":2},null,null,null,null,null,null,null,{"$f":"$A9","v":"Total Units"},null,{"$f":"INDIRECT(\"Program!L\"&S7)","v":1},null,null,null,null,null,null,null,{"$f":"$A9","v":"Total Units"},null,{"$f":"INDIRECT(\"Program!L\"&AC7)","v":2},null,null,null,null,null,null,null,{"$f":"$A9","v":"Total Units"},null,{"$f":"INDIRECT(\"Program!L\"&AM7)","v":""},null,null,null,null,null,null,null,{"$f":"$A9","v":"Total Units"},null,{"$f":"INDIRECT(\"Program!L\"&AW7)","v":""},null,null,null,null,null,null,null,{"$f":"$A9","v":"Total Units"},null,{"$f":"INDIRECT(\"Program!L\"&BG7)","v":""},null,null,null,null,null,null,null,{"$f":"$A9","v":"Total Units"},null,{"$f":"INDIRECT(\"Program!L\"&BQ7)","v":""},null,null,null,null,null,null,null,{"$f":"$A9","v":"Total Units"},null,{"$f":"INDIRECT(\"Program!L\"&CA7)","v":""},null,null,null,null,null,null,null,{"$f":"$A9","v":"Total Units"},null,{"$f":"INDIRECT(\"Program!L\"&CK7)","v":""},null,null,null,null,null,null,null,{"$f":"$A9","v":"Total Units"},null,{"$f":"INDIRECT(\"Program!L\"&CU7)","v":""}]
["Total Gross SF",null,{"$f":"SUM(Program!$D$8:$D$17)","v":11400},null,null,null,null,null,{"$f":"$A10","v":"Total Gross SF"},null,{"$f":"IFERROR(INDIRECT(\"Program!M\"&I7)*'Dev Budget'!K9,\"\")","v":4400},null,null,null,null,null,null,null,{"$f":"$A10","v":"Total Gross SF"},null,{"$f":"IFERROR(INDIRECT(\"Program!M\"&S7)*'Dev Budget'!U9,\"\")","v":3000},null,null,null,null,null,null,null,{"$f":"$A10","v":"Total Gross SF"},null,{"$f":"IFERROR(INDIRECT(\"Program!M\"&AC7)*'Dev Budget'!AE9,\"\")","v":4000},null,null,null,null,null,null,null,{"$f":"$A10","v":"Total Gross SF"},null,{"$f":"IFERROR(INDIRECT(\"Program!M\"&AM7)*'Dev Budget'!AO9,\"\")","v":""},null,null,null,null,null,null,null,{"$f":"$A10","v":"Total Gross SF"},null,{"$f":"IFERROR(INDIRECT(\"Program!M\"&AW7)*'Dev Budget'!AY9,\"\")","v":""},null,null,null,null,null,null,null,{"$f":"$A10","v":"Total Gross SF"},null,{"$f":"IFERROR(INDIRECT(\"Program!M\"&BG7)*'Dev Budget'!BI9,\"\")","v":""},null,null,null,null,null,null,null,{"$f":"$A10","v":"Total Gross SF"},null,{"$f":"IFERROR(INDIRECT(\"Program!M\"&BQ7)*'Dev Budget'!BS9,\"\")","v":""},null,null,null,null,null,null,null,{"$f":"$A10","v":"Total Gross SF"},null,{"$f":"IFERROR(INDIRECT(\"Program!M\"&CA7)*'Dev Budget'!CC9,\"\")","v":""},null,null,null,null,null,null,null,{"$f":"$A10","v":"Total Gross SF"},null,{"$f":"IFERROR(INDIRECT(\"Program!M\"&CK7)*'Dev Budget'!CM9,\"\")","v":""},null,null,null,null,null,null,null,{"$f":"$A10","v":"Total Gross SF"},null,{"$f":"IFERROR(INDIRECT(\"Program!M\"&CU7)*'Dev Budget'!CW9,\"\")","v":""}]
{"$rows_left_out":99}
{"sheet":"Program Summary","index":8,"n_rows":49,"n_cols":33,"rows_kept":49,"cut":false,"hidden":false,"merged":[]}
[]
["PROJECT NAME",{"$f":"[2]Instructions!$C$15","v":"Project A"}]
["DEVELOPER/SPONSOR",{"$f":"[2]Instructions!$C$16","v":"Apex Developers"}]
[]
["For-Sale Program Summary"]
[]
[null,null,null,"p","z","aj","at","bd","bn","bx","ch","cr","db"]
["Project Type",null,"Total or Average","A","B","C","D","E","F","G","H","I","J"]
["Project Type Description",{"$f":"[2]Program!K7","v":"Project Type"},null,{"$f":"IFERROR(INDEX(Program!$J$7:$N$17,MATCH('Program Summary'!D$8,Program!$J$7:$J$17,0),MATCH('Program Summary'!$B9,Program!$J$7:$N$7,0)),\"\")","v":"2B 2ba, East Liberty"},{"$f":"IFERROR(INDEX(Program!$J$7:$N$17,MATCH('Program Summary'!E$8,Program!$J$7:$J$17,0),MATCH('Program Summary'!$B9,Program!$J$7:$N$7,0)),\"\")","v":"3B 2ba, East Liberty"},{"$f":"IFERROR(INDEX(Program!$J$7:$N$17,MATCH('Program Summary'!F$8,Program!$J$7:$J$17,0),MATCH('Program Summary'!$B9,Program!$J$7:$N$7,0)),\"\")","v":"2B 2ba, Larimer"},{"$f":"IFERROR(INDEX(Program!$J$7:$N$17,MATCH('Program Summary'!G$8,Program!$J$7:$J$17,0),MATCH('Program Summary'!$B9,Program!$J$7:$N$7,0)),\"\")","v":0},{"$f":"IFERROR(INDEX(Program!$J$7:$N$17,MATCH('Program Summary'!H$8,Program!$J$7:$J$17,0),MATCH('Program Summary'!$B9,Program!$J$7:$N$7,0)),\"\")","v":0},{"$f":"IFERROR(INDEX(Program!$J$7:$N$17,MATCH('Program Summary'!I$8,Program!$J$7:$J$17,0),MATCH('Program Summary'!$B9,Program!$J$7:$N$7,0)),\"\")","v":0},{"$f":"IFERROR(INDEX(Program!$J$7:$N$17,MATCH('Program Summary'!J$8,Program!$J$7:$J$17,0),MATCH('Program Summary'!$B9,Program!$J$7:$N$7,0)),\"\")","v":0},{"$f":"IFERROR(INDEX(Program!$J$7:$N$17,MATCH('Program Summary'!K$8,Program!$J$7:$J$17,0),MATCH('Program Summary'!$B9,Program!$J$7:$N$7,0)),\"\")","v":0},{"$f":"IFERROR(INDEX(Program!$J$7:$N$17,MATCH('Program Summary'!L$8,Program!$J$7:$J$17,0),MATCH('Program Summary'!$B9,Program!$J$7:$N$7,0)),\"\")","v":0},{"$f":"IFERROR(INDEX(Program!$J$7:$N$17,MATCH('Program Summary'!M$8,Program!$J$7:$J$17,0),MATCH('Program Summary'!$B9,Program!$J$7:$N$7,0)),\"\")","v":0},{"$f":"IFERROR(INDEX(Program!$J$7:$N$17,MATCH('Program Summary'!N$8,Program!$J$7:$J$17,0),MATCH('Program Summary'!$B9,Program!$J$7:$N$7,0)),\"\")","v":""},{"$f":"IFERROR(INDEX(Program!$J$7:$N$17,MATCH('Program Summary'!O$8,Program!$J$7:$J$17,0),MATCH('Program Summary'!$B9,Program!$J$7:$N$7,0)),\"\")","v":""},{"$f":"IFERROR(INDEX(Program!$J$7:$N$17,MATCH('Program Summary'!P$8,Program!$J$7:$J$17,0),MATCH('Program Summary'!$B9,Program!$J$7:$N$7,0)),\"\")","v":""},{"$f":"IFERROR(INDEX(Program!$J$7:$N$17,MATCH('Program Summary'!Q$8,Program!$J$7:$J$17,0),MATCH('Program Summary'!$B9,Program!$J$7:$N$7,0)),\"\")","v":""},{"$f":"IFERROR(INDEX(Program!$J$7:$N$17,MATCH('Program Summary'!R$8,Program!$J$7:$J$17,0),MATCH('Program Summary'!$B9,Program!$J$7:$N$7,0)),\"\")","v":""},{"$f":"IFERROR(INDEX(Program!$J$7:$N$17,MATCH('Program Summary'!S$8,Program!$J$7:$J$17,0),MATCH('Program Summary'!$B9,Program!$J$7:$N$7,0)),\"\")","v":""},{"$f":"IFERROR(INDEX(Program!$J$7:$N$17,MATCH('Program Summary'!T$8,Program!$J$7:$J$17,0),MATCH('Program Summary'!$B9,Program!$J$7:$N$7,0)),\"\")","v":""},{"$f":"IFERROR(INDEX(Program!$J$7:$N$17,MATCH('Program Summary'!U$8,Program!$J$7:$J$17,0),MATCH('Program Summary'!$B9,Program!$J$7:$N$7,0)),\"\")","v":""},{"$f":"IFERROR(INDEX(Program!$J$7:$N$17,MATCH('Program Summary'!V$8,Program!$J$7:$J$17,0),MATCH('Program Summary'!$B9,Program!$J$7:$N$7,0)),\"\")","v":""},{"$f":"IFERROR(INDEX(Program!$J$7:$N$17,MATCH('Program Summary'!W$8,Program!$J$7:$J$17,0),MATCH('Program Summary'!$B9,Program!$J$7:$N$7,0)),\"\")","v":""},{"$f":"IFERROR(INDEX(Program!$J$7:$N$17,MATCH('Program Summary'!X$8,Program!$J$7:$J$17,0),MATCH('Program Summary'!$B9,Program!$J$7:$N$7,0)),\"\")","v":""},{"$f":"IFERROR(INDEX(Program!$J$7:$N$17,MATCH('Program Summary'!Y$8,Program!$J$7:$J$17,0),MATCH('Program Summary'!$B9,Program!$J$7:$N$7,0)),\"\")","v":""},{"$f":"IFERROR(INDEX(Program!$J$7:$N$17,MATCH('Program Summary'!Z$8,Program!$J$7:$J$17,0),MATCH('Program Summary'!$B9,Program!$J$7:$N$7,0)),\"\")","v":""},{"$f":"IFERROR(INDEX(Program!$J$7:$N$17,MATCH('Program Summary'!AA$8,Program!$J$7:$J$17,0),MATCH('Program Summary'!$B9,Program!$J$7:$N$7,0)),\"\")","v":""}]
["# of Units of this Type",{"$f":"[2]Program!L7","v":"Number of Projects"},{"$f":"SUM(D10:M10)","v":5},{"$f":"IFERROR(INDEX(Program!$J$7:$N$17,MATCH('Program Summary'!D$8,Program!$J$7:$J$17,0),MATCH('Program Summary'!$B10,Program!$J$7:$N$7,0)),\"\")","v":2},{"$f":"IFERROR(INDEX(Program!$J$7:$N$17,MATCH('Program Summary'!E$8,Program!$J$7:$J$17,0),MATCH('Program Summary'!$B10,Program!$J$7:$N$7,0)),\"\")","v":1},{"$f":"IFERROR(INDEX(Program!$J$7:$N$17,MATCH('Program Summary'!F$8,Program!$J$7:$J$17,0),MATCH('Program Summary'!$B10,Program!$J$7:$N$7,0)),\"\")","v":2},{"$f":"IFERROR(INDEX(Program!$J$7:$N$17,MATCH('Program Summary'!G$8,Program!$J$7:$J$17,0),MATCH('Program Summary'!$B10,Program!$J$7:$N$7,0)),\"\")","v":""},{"$f":"IFERROR(INDEX(Program!$J$7:$N$17,MATCH('Program Summary'!H$8,Program!$J$7:$J$17,0),MATCH('Program Summary'!$B10,Program!$J$7:$N$7,0)),\"\")","v":""},{"$f":"IFERROR(INDEX(Program!$J$7:$N$17,MATCH('Program Summary'!I$8,Program!$J$7:$J$17,0),MATCH('Program Summary'!$B10,Program!$J$7:$N$7,0)),\"\")","v":""},{"$f":"IFERROR(INDEX(Program!$J$7:$N$17,MATCH('Program Summary'!J$8,Program!$J$7:$J$17,0),MATCH('Program Summary'!$B10,Program!$J$7:$N$7,0)),\"\")","v":""},{"$f":"IFERROR(INDEX(Program!$J$7:$N$17,MATCH('Program Summary'!K$8,Program!$J$7:$J$17,0),MATCH('Program Summary'!$B10,Program!$J$7:$N$7,0)),\"\")","v":""},{"$f":"IFERROR(INDEX(Program!$J$7:$N$17,MATCH('Program Summary'!L$8,Program!$J$7:$J$17,0),MATCH('Program Summary'!$B10,Program!$J$7:$N$7,0)),\"\")","v":""},{"$f":"IFERROR(INDEX(Program!$J$7:$N$17,MATCH('Program Summary'!M$8,Program!$J$7:$J$17,0),MATCH('Program Summary'!$B10,Program!$J$7:$N$7,0)),\"\")","v":""},{"$f":"IFERROR(INDEX(Program!$J$7:$N$17,MATCH('Program Summary'!N$8,Program!$J$7:$J$17,0),MATCH('Program Summary'!$B10,Program!$J$7:$N$7,0)),\"\")","v":""},{"$f":"IFERROR(INDEX(Program!$J$7:$N$17,MATCH('Program Summary'!O$8,Program!$J$7:$J$17,0),MATCH('Program Summary'!$B10,Program!$J$7:$N$7,0)),\"\")","v":""},{"$f":"IFERROR(INDEX(Program!$J$7:$N$17,MATCH('Program Summary'!P$8,Program!$J$7:$J$17,0),MATCH('Program Summary'!$B10,Program!$J$7:$N$7,0)),\"\")","v":""},{"$f":"IFERROR(INDEX(Program!$J$7:$N$17,MATCH('Program Summary'!Q$8,Program!$J$7:$J$17,0),MATCH('Program Summary'!$B10,Program!$J$7:$N$7,0)),\"\")","v":""},{"$f":"IFERROR(INDEX(Program!$J$7:$N$17,MATCH('Program Summary'!R$8,Program!$J$7:$J$17,0),MATCH('Program Summary'!$B10,Program!$J$7:$N$7,0)),\"\")","v":""},{"$f":"IFERROR(INDEX(Program!$J$7:$N$17,MATCH('Program Summary'!S$8,Program!$J$7:$J$17,0),MATCH('Program Summary'!$B10,Program!$J$7:$N$7,0)),\"\")","v":""},{"$f":"IFERROR(INDEX(Program!$J$7:$N$17,MATCH('Program Summary'!T$8,Program!$J$7:$J$17,0),MATCH('Program Summary'!$B10,Program!$J$7:$N$7,0)),\"\")","v":""},{"$f":"IFERROR(INDEX(Program!$J$7:$N$17,MATCH('Program Summary'!U$8,Program!$J$7:$J$17,0),MATCH('Program Summary'!$B10,Program!$J$7:$N$7,0)),\"\")","v":""}]
{"$rows_left_out":40}
{"sheet":"Verifications","index":9,"n_rows":36,"n_cols":10,"rows_kept":36,"cut":false,"hidden":false,"merged":[[36,0,36,6],[21,0,21,6],[22,0,22,6],[23,0,23,6],[24,0,24,9],[26,0,26,9],[30,0,30,6],[31,0,31,6],[32,0,32,6],[33,0,33,6],[34,0,34,6],[35,0,35,6],[16,0,16,9],[19,0,19,6],[13,0,13,7],[4,0,4,9],[7,0,7,6],[9,0,9,6],[10,0,10,6],[12,0,12,6]]}
[]
["PROJECT NAME",{"$f":"[2]Instructions!$C$15","v":"Project A"}]
["DEVELOPER/SPONSOR",{"$f":"[2]Instructions!$C$16","v":"Apex Developers"}]
[]
["Minimum Affordable Unit Verification - For Sale"]
[]
["Verification",null,null,null,null,null,null,"EEHDP Units"]
["Total Number of Units Seeking Funding",null,null,null,null,null,null,{"$f":"'Program Summary'!C10","v":5}]
[]
["Number of Units Affordable to 80% AMI",null,null,null,null,null,null,3]
{"$rows_left_out":26}